{"text_format":"1","workbook":"xlsx","n_sheets":6,"sheets":["Instructions","Client Data Sheet","Portefeuilles","Fonds Investissements Russell","MasterManagerList","Allocation"],"not_rendered":{"charts":3,"images":3,"macros":1,"external_links":0,"defined_names":19,"comments":0,"pivot_tables":0},"unopened":[],"bounds":{"document_bytes":16777216,"sheet_cells":100000,"rows_first":2000,"rows_last":500,"rows_between":2000,"halvings":0,"cell_chars":16384,"cell_head_chars":4096},"cells_cut":0,"cells_raw":0,"read":"whole","date_system":"1900"}

{"sheet":"Instructions","index":0,"n_rows":21,"n_cols":3,"rows_kept":21,"cut":false,"hidden":false,"merged":[[1,1,1,3],[2,1,2,3]]}
[]
[null,"Pour un meilleur résultat merci de télécharger cet outil sur votre ordinateur"]
[null,"Utiliser cet outil directement depuis le site Internet peut causer des erreurs"]
[]
[]
[]
{"$rows_left_out":16}
{"sheet":"Client Data Sheet","index":1,"n_rows":52,"n_cols":44,"rows_kept":52,"cut":false,"hidden":false,"merged":[]}
[null,null,null,null,null,1,2,3,4,5,6,7,8,9,10,11,12,13,14,15,16,17,18,19,20,21,22,23,24,25,26,27,28,29]
["Imprimer\n(Y/N)","Nom du client","Montant d’investissement","Type de fonds","Type de proposition","Fonds de revenu à court terme Investissements Russell","Fonds à revenu fixe Investissements Russell","Fonds d’investissement à revenu fixe canadien Investissements Russell","Fonds à revenu fixe Plus Investissements Russell","Fonds d’investissement d’obligations indexées sur l’inflation Investissements Russell","Fonds d’obligations mondiales sans contrainte Investissements Russell","Fonds de titres de créance mondiaux Investissements Russell","BlueBay Global Convertible Bond Fund (Canada)","Fonds de dividendes canadien Investissements Russell","Fonds multi-facteurs actions canadiennes Investissements Russell","Fonds d’actions canadiennes Investissements Russell","Fonds de petites sociétés mondiales Investissements Russell","Fonds d'actions américaines à gestion fiscale Investissements Russell","Fonds multi-facteurs actions américaines Investissements Russell","Fonds d’actions américaines Investissements Russell","Fonds multi-facteurs actions internationales Investissements Russell","Fonds d’actions outre-mer Investissements Russell","Fonds d'actions mondiales à gestion fiscale Investissements Russell","Fonds d’actions mondiales ESG Investissements Russell","Fonds d’actions mondiales Investissements Russell","Fonds d’actions marchés émergents Investissements Russell","Fonds du marché monétaire Investissements Russell","Fonds d’infrastructures mondiales Investissements Russell","Fonds immobilier mondial Investissements Russell","Portefeuille d’actifs réels Investissements Russell","iShares Gold Trust","Invesco DB Commodity Index Tracking Fund","Fonds d’opportunités de revenu Investissements Russell","Stratégies de positionnement Investissements Russell","Total",null,"Check TR/CC","Group Name","Index"]
[1,1,1,1,1,1,1,0,1,0,0,1,0,1,1,1,1,1,1,1,1,1,1,1,1,1,1,1,1,1,0,0,1,0,1,0,0,0,0,0,0,0,0,0]
["Y","Client A",100000,"Fonds fiduciaires","Répartition de l’actif cible Investissements Russell",0.05,0.2,0,0,0,0,0.1,0,0.1,0,0.08,0.03,0.05,0,0.05,0,0.05,0.05,0,0.05,0.05,0.05,0.03,0.03,0.03,0,0,0,0,{"$f":"SUM(F4:AH4)","v":1.0000000000000002},null,{"$f":"($D4=$AQ$11)*SUMPRODUCT(--($E4=InputSelectionTR))+($D4=$AR$11)*SUMPRODUCT(--($E4=InputSelectionCC))","v":1},{"$f":"VLOOKUP($E4,Allocation!$J$40:$M$65,4,FALSE)","v":"Fonds Investissements Russell"},{"$f":"VLOOKUP($E4,Allocation!$J$40:$M$65,3,FALSE)","v":"SAA"}]
["N","Client B",100000,"Fonds fiduciaires","Portefeuille de revenu prudent Investissements Russell",{"$f":"IFERROR(INDEX(Allocation!$K$4:$AL$32,MATCH(F$2,Allocation!$J$4:$J$32,0),MATCH($AM5,Allocation!$K$3:$AL$3,0))/100,\"\")","v":0},{"$f":"IFERROR(INDEX(Allocation!$K$4:$AL$32,MATCH(G$2,Allocation!$J$4:$J$32,0),MATCH($AM5,Allocation!$K$3:$AL$3,0))/100,\"\")","v":0.6},{"$f":"IFERROR(INDEX(Allocation!$K$4:$AL$32,MATCH(H$2,Allocation!$J$4:$J$32,0),MATCH($AM5,Allocation!$K$3:$AL$3,0))/100,\"\")","v":0},{"$f":"IFERROR(INDEX(Allocation!$K$4:$AL$32,MATCH(I$2,Allocation!$J$4:$J$32,0),MATCH($AM5,Allocation!$K$3:$AL$3,0))/100,\"\")","v":0},{"$f":"IFERROR(INDEX(Allocation!$K$4:$AL$32,MATCH(J$2,Allocation!$J$4:$J$32,0),MATCH($AM5,Allocation!$K$3:$AL$3,0))/100,\"\")","v":0.01},{"$f":"IFERROR(INDEX(Allocation!$K$4:$AL$32,MATCH(K$2,Allocation!$J$4:$J$32,0),MATCH($AM5,Allocation!$K$3:$AL$3,0))/100,\"\")","v":0},{"$f":"IFERROR(INDEX(Allocation!$K$4:$AL$32,MATCH(L$2,Allocation!$J$4:$J$32,0),MATCH($AM5,Allocation!$K$3:$AL$3,0))/100,\"\")","v":0.14000000000000001},{"$f":"IFERROR(INDEX(Allocation!$K$4:$AL$32,MATCH(M$2,Allocation!$J$4:$J$32,0),MATCH($AM5,Allocation!$K$3:$AL$3,0))/100,\"\")","v":0},{"$f":"IFERROR(INDEX(Allocation!$K$4:$AL$32,MATCH(N$2,Allocation!$J$4:$J$32,0),MATCH($AM5,Allocation!$K$3:$AL$3,0))/100,\"\")","v":0.06},{"$f":"IFERROR(INDEX(Allocation!$K$4:$AL$32,MATCH(O$2,Allocation!$J$4:$J$32,0),MATCH($AM5,Allocation!$K$3:$AL$3,0))/100,\"\")","v":0},{"$f":"IFERROR(INDEX(Allocation!$K$4:$AL$32,MATCH(P$2,Allocation!$J$4:$J$32,0),MATCH($AM5,Allocation!$K$3:$AL$3,0))/100,\"\")","v":0},{"$f":"IFERROR(INDEX(Allocation!$K$4:$AL$32,MATCH(Q$2,Allocation!$J$4:$J$32,0),MATCH($AM5,Allocation!$K$3:$AL$3,0))/100,\"\")","v":0.02},{"$f":"IFERROR(INDEX(Allocation!$K$4:$AL$32,MATCH(R$2,Allocation!$J$4:$J$32,0),MATCH($AM5,Allocation!$K$3:$AL$3,0))/100,\"\")","v":0},{"$f":"IFERROR(INDEX(Allocation!$K$4:$AL$32,MATCH(S$2,Allocation!$J$4:$J$32,0),MATCH($AM5,Allocation!$K$3:$AL$3,0))/100,\"\")","v":0},{"$f":"IFERROR(INDEX(Allocation!$K$4:$AL$32,MATCH(T$2,Allocation!$J$4:$J$32,0),MATCH($AM5,Allocation!$K$3:$AL$3,0))/100,\"\")","v":0},{"$f":"IFERROR(INDEX(Allocation!$K$4:$AL$32,MATCH(U$2,Allocation!$J$4:$J$32,0),MATCH($AM5,Allocation!$K$3:$AL$3,0))/100,\"\")","v":0},{"$f":"IFERROR(INDEX(Allocation!$K$4:$AL$32,MATCH(V$2,Allocation!$J$4:$J$32,0),MATCH($AM5,Allocation!$K$3:$AL$3,0))/100,\"\")","v":0},{"$f":"IFERROR(INDEX(Allocation!$K$4:$AL$32,MATCH(W$2,Allocation!$J$4:$J$32,0),MATCH($AM5,Allocation!$K$3:$AL$3,0))/100,\"\")","v":0},{"$f":"IFERROR(INDEX(Allocation!$K$4:$AL$32,MATCH(X$2,Allocation!$J$4:$J$32,0),MATCH($AM5,Allocation!$K$3:$AL$3,0))/100,\"\")","v":0},{"$f":"IFERROR(INDEX(Allocation!$K$4:$AL$32,MATCH(Y$2,Allocation!$J$4:$J$32,0),MATCH($AM5,Allocation!$K$3:$AL$3,0))/100,\"\")","v":0.03},{"$f":"IFERROR(INDEX(Allocation!$K$4:$AL$32,MATCH(Z$2,Allocation!$J$4:$J$32,0),MATCH($AM5,Allocation!$K$3:$AL$3,0))/100,\"\")","v":0.02},{"$f":"IFERROR(INDEX(Allocation!$K$4:$AL$32,MATCH(AA$2,Allocation!$J$4:$J$32,0),MATCH($AM5,Allocation!$K$3:$AL$3,0))/100,\"\")","v":0},{"$f":"IFERROR(INDEX(Allocation!$K$4:$AL$32,MATCH(AB$2,Allocation!$J$4:$J$32,0),MATCH($AM5,Allocation!$K$3:$AL$3,0))/100,\"\")","v":2.5000000000000001E-2},{"$f":"IFERROR(INDEX(Allocation!$K$4:$AL$32,MATCH(AC$2,Allocation!$J$4:$J$32,0),MATCH($AM5,Allocation!$K$3:$AL$3,0))/100,\"\")","v":2.5000000000000001E-2},{"$f":"IFERROR(INDEX(Allocation!$K$4:$AL$32,MATCH(AD$2,Allocation!$J$4:$J$32,0),MATCH($AM5,Allocation!$K$3:$AL$3,0))/100,\"\")","v":0},{"$f":"IFERROR(INDEX(Allocation!$K$4:$AL$32,MATCH(AE$2,Allocation!$J$4:$J$32,0),MATCH($AM5,Allocation!$K$3:$AL$3,0))/100,\"\")","v":0},{"$f":"IFERROR(INDEX(Allocation!$K$4:$AL$32,MATCH(AF$2,Allocation!$J$4:$J$32,0),MATCH($AM5,Allocation!$K$3:$AL$3,0))/100,\"\")","v":0},{"$f":"IFERROR(INDEX(Allocation!$K$4:$AL$32,MATCH(AG$2,Allocation!$J$4:$J$32,0),MATCH($AM5,Allocation!$K$3:$AL$3,0))/100,\"\")","v":0.06},{"$f":"IFERROR(INDEX(Allocation!$K$4:$AL$32,MATCH(AH$2,Allocation!$J$4:$J$32,0),MATCH($AM5,Allocation!$K$3:$AL$3,0))/100,\"\")","v":0.01},{"$f":"SUM(F5:AH5)","v":1.0000000000000002},null,1,{"$f":"VLOOKUP($E5,Allocation!$J$40:$M$65,4,FALSE)","v":"Portefeuilles de revenu Investissements Russell"},{"$f":"VLOOKUP($E5,Allocation!$J$40:$M$65,3,FALSE)","v":"RICI"}]
["N","Client C",100000,"Fonds fiduciaires","Portefeuille essentiel de revenu Investissements Russell",{"$f":"IFERROR(INDEX(Allocation!$K$4:$AL$32,MATCH(F$2,Allocation!$J$4:$J$32,0),MATCH($AM6,Allocation!$K$3:$AL$3,0))/100,\"\")","v":0},{"$f":"IFERROR(INDEX(Allocation!$K$4:$AL$32,MATCH(G$2,Allocation!$J$4:$J$32,0),MATCH($AM6,Allocation!$K$3:$AL$3,0))/100,\"\")","v":0.49},{"$f":"IFERROR(INDEX(Allocation!$K$4:$AL$32,MATCH(H$2,Allocation!$J$4:$J$32,0),MATCH($AM6,Allocation!$K$3:$AL$3,0))/100,\"\")","v":0},{"$f":"IFERROR(INDEX(Allocation!$K$4:$AL$32,MATCH(I$2,Allocation!$J$4:$J$32,0),MATCH($AM6,Allocation!$K$3:$AL$3,0))/100,\"\")","v":0},{"$f":"IFERROR(INDEX(Allocation!$K$4:$AL$32,MATCH(J$2,Allocation!$J$4:$J$32,0),MATCH($AM6,Allocation!$K$3:$AL$3,0))/100,\"\")","v":0.01},{"$f":"IFERROR(INDEX(Allocation!$K$4:$AL$32,MATCH(K$2,Allocation!$J$4:$J$32,0),MATCH($AM6,Allocation!$K$3:$AL$3,0))/100,\"\")","v":0},{"$f":"IFERROR(INDEX(Allocation!$K$4:$AL$32,MATCH(L$2,Allocation!$J$4:$J$32,0),MATCH($AM6,Allocation!$K$3:$AL$3,0))/100,\"\")","v":0.13},{"$f":"IFERROR(INDEX(Allocation!$K$4:$AL$32,MATCH(M$2,Allocation!$J$4:$J$32,0),MATCH($AM6,Allocation!$K$3:$AL$3,0))/100,\"\")","v":0},{"$f":"IFERROR(INDEX(Allocation!$K$4:$AL$32,MATCH(N$2,Allocation!$J$4:$J$32,0),MATCH($AM6,Allocation!$K$3:$AL$3,0))/100,\"\")","v":0.09},{"$f":"IFERROR(INDEX(Allocation!$K$4:$AL$32,MATCH(O$2,Allocation!$J$4:$J$32,0),MATCH($AM6,Allocation!$K$3:$AL$3,0))/100,\"\")","v":0},{"$f":"IFERROR(INDEX(Allocation!$K$4:$AL$32,MATCH(P$2,Allocation!$J$4:$J$32,0),MATCH($AM6,Allocation!$K$3:$AL$3,0))/100,\"\")","v":0},{"$f":"IFERROR(INDEX(Allocation!$K$4:$AL$32,MATCH(Q$2,Allocation!$J$4:$J$32,0),MATCH($AM6,Allocation!$K$3:$AL$3,0))/100,\"\")","v":0.02},{"$f":"IFERROR(INDEX(Allocation!$K$4:$AL$32,MATCH(R$2,Allocation!$J$4:$J$32,0),MATCH($AM6,Allocation!$K$3:$AL$3,0))/100,\"\")","v":0},{"$f":"IFERROR(INDEX(Allocation!$K$4:$AL$32,MATCH(S$2,Allocation!$J$4:$J$32,0),MATCH($AM6,Allocation!$K$3:$AL$3,0))/100,\"\")","v":0},{"$f":"IFERROR(INDEX(Allocation!$K$4:$AL$32,MATCH(T$2,Allocation!$J$4:$J$32,0),MATCH($AM6,Allocation!$K$3:$AL$3,0))/100,\"\")","v":0.05},{"$f":"IFERROR(INDEX(Allocation!$K$4:$AL$32,MATCH(U$2,Allocation!$J$4:$J$32,0),MATCH($AM6,Allocation!$K$3:$AL$3,0))/100,\"\")","v":0},{"$f":"IFERROR(INDEX(Allocation!$K$4:$AL$32,MATCH(V$2,Allocation!$J$4:$J$32,0),MATCH($AM6,Allocation!$K$3:$AL$3,0))/100,\"\")","v":0.03},{"$f":"IFERROR(INDEX(Allocation!$K$4:$AL$32,MATCH(W$2,Allocation!$J$4:$J$32,0),MATCH($AM6,Allocation!$K$3:$AL$3,0))/100,\"\")","v":0},{"$f":"IFERROR(INDEX(Allocation!$K$4:$AL$32,MATCH(X$2,Allocation!$J$4:$J$32,0),MATCH($AM6,Allocation!$K$3:$AL$3,0))/100,\"\")","v":0},{"$f":"IFERROR(INDEX(Allocation!$K$4:$AL$32,MATCH(Y$2,Allocation!$J$4:$J$32,0),MATCH($AM6,Allocation!$K$3:$AL$3,0))/100,\"\")","v":0.05},{"$f":"IFERROR(INDEX(Allocation!$K$4:$AL$32,MATCH(Z$2,Allocation!$J$4:$J$32,0),MATCH($AM6,Allocation!$K$3:$AL$3,0))/100,\"\")","v":0.02},{"$f":"IFERROR(INDEX(Allocation!$K$4:$AL$32,MATCH(AA$2,Allocation!$J$4:$J$32,0),MATCH($AM6,Allocation!$K$3:$AL$3,0))/100,\"\")","v":0},{"$f":"IFERROR(INDEX(Allocation!$K$4:$AL$32,MATCH(AB$2,Allocation!$J$4:$J$32,0),MATCH($AM6,Allocation!$K$3:$AL$3,0))/100,\"\")","v":2.5000000000000001E-2},{"$f":"IFERROR(INDEX(Allocation!$K$4:$AL$32,MATCH(AC$2,Allocation!$J$4:$J$32,0),MATCH($AM6,Allocation!$K$3:$AL$3,0))/100,\"\")","v":2.5000000000000001E-2},{"$f":"IFERROR(INDEX(Allocation!$K$4:$AL$32,MATCH(AD$2,Allocation!$J$4:$J$32,0),MATCH($AM6,Allocation!$K$3:$AL$3,0))/100,\"\")","v":0},{"$f":"IFERROR(INDEX(Allocation!$K$4:$AL$32,MATCH(AE$2,Allocation!$J$4:$J$32,0),MATCH($AM6,Allocation!$K$3:$AL$3,0))/100,\"\")","v":0},{"$f":"IFERROR(INDEX(Allocation!$K$4:$AL$32,MATCH(AF$2,Allocation!$J$4:$J$32,0),MATCH($AM6,Allocation!$K$3:$AL$3,0))/100,\"\")","v":0},{"$f":"IFERROR(INDEX(Allocation!$K$4:$AL$32,MATCH(AG$2,Allocation!$J$4:$J$32,0),MATCH($AM6,Allocation!$K$3:$AL$3,0))/100,\"\")","v":0.05},{"$f":"IFERROR(INDEX(Allocation!$K$4:$AL$32,MATCH(AH$2,Allocation!$J$4:$J$32,0),MATCH($AM6,Allocation!$K$3:$AL$3,0))/100,\"\")","v":0.01},1.0000000000000002,null,1,{"$f":"VLOOKUP($E6,Allocation!$J$40:$M$65,4,FALSE)","v":"Portefeuilles de revenu Investissements Russell"},{"$f":"VLOOKUP($E6,Allocation!$J$40:$M$65,3,FALSE)","v":"RIEP"}]
{"$rows_left_out":47}
{"sheet":"Portefeuilles","index":2,"n_rows":158,"n_cols":6,"rows_kept":158,"cut":false,"hidden":false,"merged":[[157,0,157,5],[155,0,155,5],[146,0,146,5],[156,0,156,5],[147,0,147,5],[148,0,148,5],[149,0,149,5],[150,0,150,5],[151,0,151,5],[0,0,0,4],[1,2,3,2],[152,0,152,5],[153,0,153,5],[154,0,154,5],[145,0,145,5]]}
["Portefeuilles de revenu Investissements Russell"]
[null,null,"Portefeuille diversifié de revenu mensuel Investissements Russell",null,"Client"]
[null,null,null,null,{"$f":"Allocation!$E$34 &\" sous-conseiller\"","v":"62 sous-conseiller"}]
[null,null,null,null,{"$f":"Allocation!$D$34 &\" fonds d’investissement\"","v":"13 fonds d’investissement"}]
[]
[null,null,null,null,"Montant total portefeuille",100000]
{"$rows_left_out":153}
{"sheet":"Fonds Investissements Russell","index":3,"n_rows":158,"n_cols":8,"rows_kept":158,"cut":false,"hidden":false,"merged":[[155,0,155,5],[156,0,156,5],[157,0,157,5],[146,0,146,5],[150,0,150,5],[151,0,151,5],[152,0,152,5],[153,0,153,5],[154,0,154,5],[0,0,0,4],[147,0,147,5],[148,0,148,5],[149,0,149,5],[1,2,3,2],[145,0,145,5]]}
["Fonds Investissements Russell"]
[null,null,"Répartition de l’actif cible Investissements Russell",null,"Client"]
[null,null,null,null,"76 sous-conseiller"]
[null,null,null,null,"16 fonds d'investissement"]
[]
[null,null,null,null,"Montant total portefeuille",100000]
{"$rows_left_out":153}
{"sheet":"MasterManagerList","index":4,"n_rows":158,"n_cols":11,"rows_kept":158,"cut":false,"hidden":true,"merged":[[145,0,145,5],[146,0,146,5],[148,0,148,5],[157,0,157,5],[147,0,147,5],[151,0,151,5],[152,0,152,5],[153,0,153,5],[154,0,154,5],[156,0,156,5],[155,0,155,5],[149,0,149,5],[150,0,150,5]]}
["Fonds Investissements Russell"]
[]
[]
[]
[]
[]
{"$rows_left_out":153}
{"sheet":"Allocation","index":5,"n_rows":69,"n_cols":56,"rows_kept":69,"cut":false,"hidden":true,"merged":[[1,36,1,37],[1,1,1,2],[1,3,1,4],[1,5,1,6],[1,10,1,21],[1,23,1,34]]}
[null,null,null,null,null,null,null,null,null,"2023-12-01"]
[null,"FOR TEMPLATE",null,"Portfolio",null,null,null,null,null,null,"Strategic Allocation",null,null,null,null,null,null,null,null,null,null,null,null,"Tactical Allocation",null,null,null,null,null,null,null,null,null,null,null,null,"Default",null,null,"Test"]
[null,"Current Allocation","Current # Sub-advisers","Portfolio","Current # Sub-advisers",null,null,"# Sub-advisers",null,"Fund Name","RICI","RIEP","RDMIP","MAIS","MAGIS","MAGS","MAIE","RIB","RIBG","RILTG","MFGB","RA",null,"RICI-T","RIEP-T","RDMIP-T","MAIS-T","MAGIS-T","MAGS-T","MAIE-T","RIB-T","RIBG-T","RILTG-T","MFGB-T","RA-T",null,"SAA","SAA-CC",null,"temp",null,null,null,null,null,null,null,"PortfolioName_Selection","Drop-down","Portefeuilles de revenu Investissements Russell","Solutions Multi-actifs Investissements Russell","Portefeuilles d’accumulation Investissements Russell","Solutions Multi-facteurs Investissements Russell","Catégories portefeuille de revenu Investissements Russell","Catégories Solutions Multi-actifs Investissements Russell","Catégories portefeuilles d’accumulation"]
[1,0.05,{"$f":"IF(B4,$H4,0)","v":3},{"$f":"INDEX($K$4:$AL$32,A4,MATCH(PortfolioIndex,$K$3:$AL$3,0))/100","v":0},{"$f":"IF(D4,$H4,0)","v":0},null,null,{"$f":"MATCH(J5,MasterManagerList!$C$9:$C$145,0)-MATCH(J4,MasterManagerList!$C$9:$C$145,0)-1","v":3},null,"Fonds de revenu à court terme Investissements Russell",0,0,0,12,5,0,0,0,0,0,0,0,null,0,0,0,11,5,0,0,0,0,0,0,0,null,5,5,null,{"$f":"100/$J$34/100","v":3.4482758620689655E-2},null,92,92,92,null,"Catégorie fonds de revenu à court terme Investissements Russell",null,"#Col:",{"$f":"MATCH(Portefeuilles!$A$1,Allocation!$AX$3:$BD$3,0)","v":1},"Portefeuille diversifié de revenu mensuel Investissements Russell","Multi-actifs stratégie de revenu","Portefeuille équilibré Investissements Russell","Multi-facteurs équilibré mondial Investissements Russell","Catégorie portefeuille diversifié de revenu mensuel Investissements Russell","Catégorie multi-actifs stratégie de revenu","Catégorie portefeuille équilibré Investissements Russell"]
[2,0.2,5,0.31,{"$f":"IF(D5,$H5,0)","v":5},null,null,{"$f":"MATCH(J6,MasterManagerList!$C$9:$C$145,0)-MATCH(J5,MasterManagerList!$C$9:$C$145,0)-1","v":5},null,"Fonds à revenu fixe Investissements Russell",60,49,31,33,19,5,0,0,0,0,30,0,null,63,52,34.5,35,22,7.0000000000000009,0,0,0,0,32,0,null,20,0,null,3.4482758620689655E-2,null,158,158,158,null,"Fonds à revenu fixe Investissements Russell",null,"RowCount:",{"$f":"INDEX($AX$12:$BD$12,1,$AW$4)","v":3},"Portefeuille essentiel de revenu Investissements Russell","Multi-actifs stratégie de croissance et de revenu","Portefeuille équilibré de croissance Investissements Russell",null,"Catégorie portefeuille essentiel de revenu Investissements Russell","Catégorie multi-actifs stratégie de croissance et de revenu","Catégorie portefeuille équilibré de croissance Investissements Russell"]
[3,0,0,0,0,null,null,{"$f":"MATCH(J7,MasterManagerList!$C$9:$C$145,0)-MATCH(J6,MasterManagerList!$C$9:$C$145,0)-1","v":4},null,"Fonds d’investissement à revenu fixe canadien Investissements Russell",0,0,0,0,0,0,0,46,33,16,0,0,null,0,0,0,0,0,0,0,50,37,20,0,0,null,0,20,null,3.4482758620689655E-2,null,158,158,158,null,"Catégorie fonds à revenu fixe Investissements Russell¹ **",null,null,null,"Portefeuille de revenu prudent Investissements Russell","Multi-actifs stratégie de croissance","Portefeuille de croissance à long terme Investissements Russell",null,"Catégorie portefeuille de revenu prudent Investissements Russell","Catégorie multi-actifs stratégie de croissance","Catégorie portefeuille de croissance à long terme Investissements Russell"]
{"$rows_left_out":63}